BDBM50193489 (R)-1-(4-nitrophenylsulfonyl)-N-((R,S)-1-oxo-3-phenylpropan-2-yl)pyrrolidine-2-carboxamide::CHEMBL209491
SMILES [O-][N+](=O)c1ccc(cc1)S(=O)(=O)N1CCC[C@@H]1C(=O)NC(Cc1ccccc1)C=O
InChI Key InChIKey=HFUIVSBLOYNQJD-LRTDYKAYSA-N
Data  2 KI
  Tab Delimited (TSV)   2D SDfile   Computed 3D by Vconf -m prep SDfile
Find this compound or compounds like it in BindingDB:
Activity Spreadsheet -- Enzyme Inhibition Constant Data from BindingDB
Found 2 hits for monomerid = 50193489
TargetCalpain-1 catalytic subunit(Sus scrofa (pig))
The University Of Tennessee Health Science Center
Curated by ChEMBL
LigandPNGBDBM50193489((R)-1-(4-nitrophenylsulfonyl)-N-((R,S)-1-oxo-3-phe...)
Affinity DataKi:  20nM. Assay description: Inhibition of porcine erythrocyte mu calpain
In DepthDetails ArticlePubMed
TargetCathepsin B(Homo sapiens (Human))
The University Of Tennessee Health Science Center
Curated by ChEMBL
LigandPNGBDBM50193489((R)-1-(4-nitrophenylsulfonyl)-N-((R,S)-1-oxo-3-phe...)
Affinity DataKi:  3.75E+3nM. Assay description: Inhibition of human liver cathepsin B
In DepthDetails ArticlePubMed