BDBM50193631 (E)-N-(4-amino-2-propylquinolin-6-yl)-3-(3-chlorophenyl)acrylamide::CHEMBL214843
SMILES CCCc1cc(N)c2cc(NC(=O)\C=C\c3cccc(Cl)c3)ccc2n1
InChI Key InChIKey=BFLZUTXQMJOMAL-JXMROGBWSA-N
Data  1 IC50
  Tab Delimited (TSV)   2D SDfile   Computed 3D by Vconf -m prep SDfile
Find this compound or compounds like it in BindingDB:
Activity Spreadsheet -- Enzyme Inhibition Constant Data from BindingDB
Found 1 hit for monomerid = 50193631
TargetMelanin-concentrating hormone receptor 1(Homo sapiens (Human))
Merck Research Laboratories
Curated by ChEMBL
LigandPNGBDBM50193631((E)-N-(4-amino-2-propylquinolin-6-yl)-3-(3-chlorop...)
Affinity DataIC50:  1.10E+3nM. Assay description: Displacement of 125I-[Phe13,Tyr19]-MCH from human MCH-R1
In DepthDetails ArticlePubMed