BDBM50193652 (E)-N-(4-amino-2-propylquinolin-6-yl)-3-(4-propylphenyl)acrylamide::CHEMBL217462
SMILES CCCc1ccc(\C=C\C(=O)Nc2ccc3nc(CCC)cc(N)c3c2)cc1
InChI Key InChIKey=CQVXFZJUXUJIPF-SDNWHVSQSA-N
Data  1 IC50  1 EC50
  Tab Delimited (TSV)   2D SDfile   Computed 3D by Vconf -m prep SDfile
Find this compound or compounds like it in BindingDB:
Activity Spreadsheet -- Enzyme Inhibition Constant Data from BindingDB
Found 2 hits for monomerid = 50193652
TargetMelanin-concentrating hormone receptor 1(Homo sapiens (Human))
Merck Research Laboratories
Curated by ChEMBL
LigandPNGBDBM50193652((E)-N-(4-amino-2-propylquinolin-6-yl)-3-(4-propylp...)
Affinity DataIC50:  4nM. Assay description: Displacement of 125I-[Phe13,Tyr19]-MCH from human MCH-R1
In DepthDetails ArticlePubMed
TargetMelanin-concentrating hormone receptor 1(Homo sapiens (Human))
Merck Research Laboratories
Curated by ChEMBL
LigandPNGBDBM50193652((E)-N-(4-amino-2-propylquinolin-6-yl)-3-(4-propylp...)
Affinity DataEC50:  3.60E+3nM. Assay description: Stimulation of IP3-coupled mobilization of calcium in HEK293 cells expressing MCH-R1
In DepthDetails ArticlePubMed