BDBM50193695 CHEMBL214541::N-(2-(methylamino)quinolin-6-yl)-3-(4-(trifluoromethyl)phenyl)propanamide
SMILES CNc1ccc2cc(NC(=O)CCc3ccc(cc3)C(F)(F)F)ccc2n1
InChI Key InChIKey=VXMXEDWIHDHRKH-UHFFFAOYSA-N
Data  1 IC50  1 EC50
  Tab Delimited (TSV)   2D SDfile   Computed 3D by Vconf -m prep SDfile
Find this compound or compounds like it in BindingDB:
Activity Spreadsheet -- Enzyme Inhibition Constant Data from BindingDB
Found 2 hits for monomerid = 50193695
TargetMelanin-concentrating hormone receptor 1(Homo sapiens (Human))
Merck Research Laboratories
Curated by ChEMBL
LigandPNGBDBM50193695(CHEMBL214541 | N-(2-(methylamino)quinolin-6-yl)-3-...)
Affinity DataIC50:  20nM. Assay description: Displacement of 125I-[Phe13,Tyr19]-MCH from human MCH-R1
In DepthDetails ArticlePubMed
TargetMelanin-concentrating hormone receptor 1(RAT)
Merck Research Laboratories
Curated by ChEMBL
LigandPNGBDBM50193695(CHEMBL214541 | N-(2-(methylamino)quinolin-6-yl)-3-...)
Affinity DataEC50:  330nM. Assay description: Stimulation of IP3-coupled mobilization of calcium in HEK293 cells expressing rat MCH-R1
In DepthDetails ArticlePubMed