BDBM50193804 (S)-6-(4-(2-(3-(3-(2-cyclobutylethyl)-2-oxo-2,3-dihydro-1H-benzo[d]imidazol-4-yloxy)-2-hydroxypropylamino)-2-methylpropyl)phenoxy)nicotinamide::CHEMBL374867
SMILES CC(C)(Cc1ccc(Oc2ccc(cn2)C(N)=O)cc1)NC[C@H](O)COc1cccc2[nH]c(=O)n(CCC3CCC3)c12
InChI Key InChIKey=HJPFFQXHOWOXMX-DEOSSOPVSA-N
Data  4 EC50
  Tab Delimited (TSV)   2D SDfile   Computed 3D by Vconf -m prep SDfile
Find this compound or compounds like it in BindingDB:
Activity Spreadsheet -- Enzyme Inhibition Constant Data from BindingDB
Found 4 hits for monomerid = 50193804
TargetBeta-2 adrenergic receptor(Homo sapiens (Human))
Eli Lilly
Curated by ChEMBL
LigandPNGBDBM50193804((S)-6-(4-(2-(3-(3-(2-cyclobutylethyl)-2-oxo-2,3-di...)
Affinity DataEC50: >1.00E+4nM. Assay description: Agonist activity at human beta-2 adrenergic receptor expressed in CHO cells assessed as cAMP levels
In DepthDetails ArticlePubMed
TargetBeta-3 adrenergic receptor(Rattus norvegicus)
Eli Lilly
Curated by ChEMBL
LigandPNGBDBM50193804((S)-6-(4-(2-(3-(3-(2-cyclobutylethyl)-2-oxo-2,3-di...)
Affinity DataEC50:  29nM. Assay description: Agonist activity at rat beta-3 adrenergic receptor expressed in CHO cells assessed as cAMP levels
In DepthDetails ArticlePubMed
TargetBeta-1 adrenergic receptor(Homo sapiens (Human))
Eli Lilly
Curated by ChEMBL
LigandPNGBDBM50193804((S)-6-(4-(2-(3-(3-(2-cyclobutylethyl)-2-oxo-2,3-di...)
Affinity DataEC50: >1.00E+4nM. Assay description: Agonist activity at human beta-1 adrenergic receptor expressed in CHO cells assessed as cAMP levels
In DepthDetails ArticlePubMed
TargetBeta-3 adrenergic receptor(Homo sapiens (Human))
Eli Lilly
Curated by ChEMBL
LigandPNGBDBM50193804((S)-6-(4-(2-(3-(3-(2-cyclobutylethyl)-2-oxo-2,3-di...)
Affinity DataEC50:  10nM. Assay description: Agonist activity at human beta3 adrenergic receptor expressed in CHO cells assessed as cAMP levels
In DepthDetails ArticlePubMed