BDBM50194209 (1R,2R)-trans-2-(cyclohexylmethylamino)methyl-1-(1H-imidazol-4yl)cyclopropane::CHEMBL212705
SMILES C(NCC1CCCCC1)[C@@H]1C[C@H]1c1cnc[nH]1
InChI Key InChIKey=SGHHKDMDVKJWOL-QWHCGFSZSA-N
Data  2 KI
  Tab Delimited (TSV)   2D SDfile   Computed 3D by Vconf -m prep SDfile
Find this compound or compounds like it in BindingDB:
Activity Spreadsheet -- Enzyme Inhibition Constant Data from BindingDB
Found 2 hits for monomerid = 50194209
TargetHistamine H3 receptor(Homo sapiens (Human))
Hokkaido University
Curated by ChEMBL
LigandPNGBDBM50194209((1R,2R)-trans-2-(cyclohexylmethylamino)methyl-1-(1...)
Affinity DataKi:  34.4nM. Assay description: Displacement of [3H]Nalpha-methylhistamine form human H3 receptor
In DepthDetails ArticlePubMed
TargetHistamine H4 receptor(Homo sapiens (Human))
Hokkaido University
Curated by ChEMBL
LigandPNGBDBM50194209((1R,2R)-trans-2-(cyclohexylmethylamino)methyl-1-(1...)
Affinity DataKi:  143nM. Assay description: Displacement of [3H]histamine form human H4 receptor
In DepthDetails ArticlePubMed