BDBM50194250 CHEMBL3985510
SMILES COC(=O)[C@H](CO)NC(=O)[C@H](CCCCN1CCCCCC1)NC(=O)[C@H](CC(C)C)NC(=O)[C@H](C)NC(=O)[C@H](Cc1ccccc1)NC(=O)CNC(=O)c1ccccc1
InChI Key InChIKey=IAUNQJODSCIDIR-WMUVQLMLSA-N
Data  5 IC50
  Tab Delimited (TSV)   2D SDfile   Computed 3D by Vconf -m prep SDfile
Find this compound or compounds like it in BindingDB:
Activity Spreadsheet -- Enzyme Inhibition Constant Data from BindingDB
Found 5 hits for monomerid = 50194250
TargetE3 SUMO-protein ligase CBX4(Homo sapiens (Human))
University Of North Carolina At Chapel Hill
Curated by ChEMBL
LigandPNGBDBM50194250(CHEMBL3985510)
Affinity DataIC50: >6.00E+4nM. Assay description: Antagonist activity at recombinant human N-terminal His-tagged CBX4 chromodomain (8 to 65 residues) expressed in Escherichia coli Rosetta BL21(DE3)pL...
In DepthDetails ArticlePubMed
TargetChromodomain Y-like protein 2(Homo sapiens (Human))
University Of North Carolina At Chapel Hill
Curated by ChEMBL
LigandPNGBDBM50194250(CHEMBL3985510)
Affinity DataIC50:  590nM. Assay description: Antagonist activity at recombinant human C-terminal His-tagged CDYL2 chromodomain (1 to 75 residues) expressed in Escherichia coli Rosetta BL21(DE3)p...
In DepthDetails ArticlePubMed
TargetChromobox protein homolog 5(Homo sapiens (Human))
University Of North Carolina At Chapel Hill
Curated by ChEMBL
LigandPNGBDBM50194250(CHEMBL3985510)
Affinity DataIC50: >6.00E+4nM. Assay description: Antagonist activity at recombinant human N-terminal His-tagged CBX5 chromodomain (18 to 75 residues) expressed in Escherichia coli Rosetta BL21(DE3)p...
In DepthDetails ArticlePubMed
TargetChromobox protein homolog 8(Homo sapiens (Human))
University Of North Carolina At Chapel Hill
Curated by ChEMBL
LigandPNGBDBM50194250(CHEMBL3985510)
Affinity DataIC50:  3.10E+4nM. Assay description: Antagonist activity at recombinant human N-terminal His-tagged CBX8 chromodomain (8 to 61 residues) expressed in Escherichia coli Rosetta BL21(DE3)pL...
In DepthDetails ArticlePubMed
TargetChromobox protein homolog 7(Homo sapiens (Human))
University Of North Carolina At Chapel Hill
Curated by ChEMBL
LigandPNGBDBM50194250(CHEMBL3985510)
Affinity DataIC50:  2.80E+4nM. Assay description: Antagonist activity at recombinant human C-terminal His-tagged CBX7 chromodomain (8 to 62 residues) expressed in Escherichia coli Rosetta BL21(DE3)pL...
In DepthDetails ArticlePubMed