BDBM50194381 CHEMBL373506::N-(3-chlorophenyl)-4-(5-(3-(3,4-dichlorophenyl)acrylamido)pentyl)-1,4-diazepane-1-carboxamide::TCMDC-135749
SMILES Clc1cccc(NC(=O)N2CCCN(CCCCCNC(=O)\C=C\c3ccc(Cl)c(Cl)c3)CC2)c1
InChI Key InChIKey=HWBDUMFRVQEBPH-PKNBQFBNSA-N
Data  1 IC50
  Tab Delimited (TSV)   2D SDfile   Computed 3D by Vconf -m prep SDfile
Find this compound or compounds like it in BindingDB:
Activity Spreadsheet -- Enzyme Inhibition Constant Data from BindingDB
Found 1 hit for monomerid = 50194381
TargetGlycogen phosphorylase, liver form(Homo sapiens (Human))
Glaxosmithkline
Curated by ChEMBL
LigandPNGBDBM50194381(CHEMBL373506 | N-(3-chlorophenyl)-4-(5-(3-(3,4-dic...)
Affinity DataIC50:  1.30E+3nM. Assay description: Inhibition of human liver GPa in presence of glucose
In DepthDetails ArticlePubMed