BDBM50194491 1-(2,6-dichloro-phenyl)-3-[4-(4-fluoro-phenoxy)-cyclohexyl]-urea::CHEMBL434749
SMILES Fc1ccc(O[C@@H]2CC[C@@H](CC2)NC(=O)Nc2c(Cl)cccc2Cl)cc1
InChI Key InChIKey=JNZUZKSIWHTRTI-OTVXOJSOSA-N
Data  1 IC50
  Tab Delimited (TSV)   2D SDfile   Computed 3D by Vconf -m prep SDfile
Find this compound or compounds like it in BindingDB:
Activity Spreadsheet -- Enzyme Inhibition Constant Data from BindingDB
Found 1 hit for monomerid = 50194491
TargetBifunctional epoxide hydrolase 2(Homo sapiens (Human))
University Of California
Curated by ChEMBL
LigandPNGBDBM50194491(1-(2,6-dichloro-phenyl)-3-[4-(4-fluoro-phenoxy)-cy...)
Affinity DataIC50:  940nM. Assay description: Inhibition of human recombinant soluble epoxide hydrolase by kinetic fluorescent assay
In DepthDetails ArticlePubMed