BDBM50194525 CHEMBL384309::methyl 5-(diisopropylamino)-5-oxo-3-phenyl-4-(pyridin-4-yl)pentanoate
SMILES COC(=O)CC(C(C(=O)N(C(C)C)C(C)C)c1ccncc1)c1ccccc1
InChI Key InChIKey=KYWHGTBFANPAHY-UHFFFAOYSA-N
Data  1 IC50
  Tab Delimited (TSV)   2D SDfile   Computed 3D by Vconf -m prep SDfile
Find this compound or compounds like it in BindingDB:
Activity Spreadsheet -- Enzyme Inhibition Constant Data from BindingDB
Found 1 hit for monomerid = 50194525
TargetPotassium voltage-gated channel subfamily A member 5(Homo sapiens (Human))
Merck Research Laboratories
Curated by ChEMBL
LigandPNGBDBM50194525(CHEMBL384309 | methyl 5-(diisopropylamino)-5-oxo-3...)
Affinity DataIC50:  1.38E+4nM. Assay description: Inhibition of Kv1.5
In DepthDetails ArticlePubMed