BDBM50194530 (3R,4S)-methyl 5-(diisopropylamino)-5-oxo-3-phenyl-4-(pyridin-3-yl)pentanoate::CHEMBL383874
SMILES COC(=O)C[C@H]([C@H](C(=O)N(C(C)C)C(C)C)c1cccnc1)c1ccccc1
InChI Key InChIKey=KVSRYMGXCMOBPD-RBBKRZOGSA-N
Data  1 IC50
  Tab Delimited (TSV)   2D SDfile   Computed 3D by Vconf -m prep SDfile
Find this compound or compounds like it in BindingDB:
Activity Spreadsheet -- Enzyme Inhibition Constant Data from BindingDB
Found 1 hit for monomerid = 50194530
TargetPotassium voltage-gated channel subfamily A member 5(Homo sapiens (Human))
Merck Research Laboratories
Curated by ChEMBL
LigandPNGBDBM50194530((3R,4S)-methyl 5-(diisopropylamino)-5-oxo-3-phenyl...)
Affinity DataIC50:  265nM. Assay description: Inhibition of Kv1.5
In DepthDetails ArticlePubMed