BDBM50194746 CHEMBL405546::diphenyl 1-[(N-o-methylbenzoyl-D-seryl)-L-alanyl]amino-2-(4-guanidinophenyl)ethanephosphonate
SMILES [#6]-[#6@H](-[#7]-[#6](=O)-[#6@@H](-[#6]-[#8])-[#7]-[#6](=O)-c1ccccc1-[#6])-[#6](=O)-[#7]-[#6](-[#6]-c1ccc(cc1)\[#7]=[#6](\[#7])-[#7])P(=O)([#8]-c1ccccc1)[#8]-c1ccccc1
InChI Key InChIKey=TYRZSNKCILDHRL-XPKRSZDKSA-N
Data  4 IC50
  Tab Delimited (TSV)   2D SDfile   Computed 3D by Vconf -m prep SDfile
Find this compound or compounds like it in BindingDB:
Activity Spreadsheet -- Enzyme Inhibition Constant Data from BindingDB
Found 4 hits for monomerid = 50194746
TargetTissue-type plasminogen activator(Homo sapiens (Human))
University Of Antwerp
Curated by ChEMBL
LigandPNGBDBM50194746(CHEMBL405546 | diphenyl 1-[(N-o-methylbenzoyl-D-se...)
Affinity DataIC50:  5.50E+3nM. Assay description: Inhibition of recombinant tPA
In DepthDetails ArticlePubMed
TargetPlasminogen(Homo sapiens (Human))
University Of Antwerp
Curated by ChEMBL
LigandPNGBDBM50194746(CHEMBL405546 | diphenyl 1-[(N-o-methylbenzoyl-D-se...)
Affinity DataIC50:  7.20E+3nM. Assay description: Inhibition of human plasmin
In DepthDetails ArticlePubMed
TargetUrokinase-type plasminogen activator(Homo sapiens (Human))
University Of Antwerp
Curated by ChEMBL
LigandPNGBDBM50194746(CHEMBL405546 | diphenyl 1-[(N-o-methylbenzoyl-D-se...)
Affinity DataIC50:  5nM. Assay description: Inhibition of human uPA
In DepthDetails ArticlePubMed
TargetProthrombin(Homo sapiens (Human))
University Of Antwerp
Curated by ChEMBL
LigandPNGBDBM50194746(CHEMBL405546 | diphenyl 1-[(N-o-methylbenzoyl-D-se...)
Affinity DataIC50:  1.59E+4nM. Assay description: Inhibition of human thrombin
In DepthDetails ArticlePubMed