BDBM50194775 CHEMBL3943629
SMILES CNCCN1CCC(CC1)OCc1ccc(Cl)cc1
InChI Key InChIKey=FOPJHWSUFHQCBW-UHFFFAOYSA-N
Data  2 IC50
  Tab Delimited (TSV)   2D SDfile   Computed 3D by Vconf -m prep SDfile
Find this compound or compounds like it in BindingDB:
Activity Spreadsheet -- Enzyme Inhibition Constant Data from BindingDB
Found 2 hits for monomerid = 50194775
TargetHistone-arginine methyltransferase CARM1(Homo sapiens (Human))
Icahn School Of Medicine At Mount Sinai
Curated by ChEMBL
LigandPNGBDBM50194775(CHEMBL3943629)
Affinity DataIC50:  18nM. Assay description: Inhibition of human full length PRMT4 (1 to 608 residues) expressed in 293F cells assessed as inhibition of methylation activity preincubated with pr...
In DepthDetails ArticlePubMed
TargetProtein arginine N-methyltransferase 6(Homo sapiens (Human))
Icahn School Of Medicine At Mount Sinai
Curated by ChEMBL
LigandPNGBDBM50194775(CHEMBL3943629)
Affinity DataIC50:  40nM. Assay description: Inhibition of human full length PRMT6 (1 to 375 residues) expressed in baculovirus expression system assessed as inhibition of methylation activity p...
In DepthDetails ArticlePubMed