BDBM50195291 4-{2-methyl-2-[4-(5-trifluoromethyl-pyridin-2-yl)-piperazin-1-yl]-propionylamino}-adamantane-1-carboxylic acid amide::CHEMBL222670
SMILES CC(C)(N1CCN(CC1)c1ccc(cn1)C(F)(F)F)C(=O)N[C@H]1C2C[C@H]3CC1C[C@](C3)(C2)C(N)=O
InChI Key InChIKey=CLHMYBJIOZXCEX-HGYLWUCXSA-N
Data  2 KI  3 IC50
  Tab Delimited (TSV)   2D SDfile   Computed 3D by Vconf -m prep SDfile
Find this compound or compounds like it in BindingDB:
Activity Spreadsheet -- Enzyme Inhibition Constant Data from BindingDB
Found 5 hits for monomerid = 50195291
Target11-beta-hydroxysteroid dehydrogenase 1(Mus musculus (mouse))
Abbott Laboratories
Curated by ChEMBL
LigandPNGBDBM50195291(4-{2-methyl-2-[4-(5-trifluoromethyl-pyridin-2-yl)-...)
Affinity DataKi:  5nM. Assay description: Inhibition of mouse truncated 11beta-HSD1 assessed as inhibition of radiolabeled cortisone to cortisol conversion by SPA
In DepthDetails ArticlePubMed
Target11-beta-hydroxysteroid dehydrogenase 1(Homo sapiens (Human))
Abbott Laboratories
Curated by ChEMBL
LigandPNGBDBM50195291(4-{2-methyl-2-[4-(5-trifluoromethyl-pyridin-2-yl)-...)
Affinity DataKi:  9nM. Assay description: Inhibition of human truncated 11beta-HSD1 assessed as inhibition of radiolabeled cortisone to cortisol conversion by SPA
In DepthDetails ArticlePubMed
Target11-beta-hydroxysteroid dehydrogenase type 2(Mus musculus (mouse))
Abbott Laboratories
Curated by ChEMBL
LigandPNGBDBM50195291(4-{2-methyl-2-[4-(5-trifluoromethyl-pyridin-2-yl)-...)
Affinity DataIC50:  3.60E+3nM. Assay description: Inhibition of mouse 11beta-HSD2 assessed as cortisol disappearance by SPA
In DepthDetails ArticlePubMed
Target11-beta-hydroxysteroid dehydrogenase 1(Homo sapiens (Human))
Abbott Laboratories
Curated by ChEMBL
LigandPNGBDBM50195291(4-{2-methyl-2-[4-(5-trifluoromethyl-pyridin-2-yl)-...)
Affinity DataIC50:  45nM. Assay description: Inhibition of human 11beta-HSD1 expressed in HEK293 cells assessed as inhibition of cortisol formation by fluorescent polarization immunoassay
In DepthDetails ArticlePubMed
Target11-beta-hydroxysteroid dehydrogenase type 2(Homo sapiens (Human))
Abbott Laboratories
Curated by ChEMBL
LigandPNGBDBM50195291(4-{2-methyl-2-[4-(5-trifluoromethyl-pyridin-2-yl)-...)
Affinity DataIC50: >1.00E+4nM. Assay description: Inhibition of human 11beta-HSD2 assessed as cortisol disappearance by SPA
In DepthDetails ArticlePubMed