BDBM50195701 CHEMBL3956293
SMILES COc1cc(OC)cc(c1)C(=O)N(CCCc1ccccc1)Cc1ccc(Oc2cccc(c2)C(O)=O)cc1
InChI Key InChIKey=CQGCQTYFJQFJBJ-UHFFFAOYSA-N
Data  1 IC50
  Tab Delimited (TSV)   2D SDfile   Computed 3D by Vconf -m prep SDfile
Find this compound or compounds like it in BindingDB:
Activity Spreadsheet -- Enzyme Inhibition Constant Data from BindingDB
Found 1 hit for monomerid = 50195701
TargetLysophosphatidic acid receptor 1(Homo sapiens (Human))
Ono Pharmaceutical
Curated by ChEMBL
LigandPNGBDBM50195701(CHEMBL3956293)
Affinity DataIC50:  140nM. Assay description: Antagonist activity at human LPA1 receptor expressed in CHO cells assessed as reduction in LPA-induced intracellular Ca2+ concentration pretreated wi...
In DepthDetails ArticlePubMed