BDBM50196130 (2-methyl-3-phenylquinolin-4-yl)-[4-(4-methylpiperazin-1-yl)-phenyl]amine::CHEMBL216290
SMILES CN1CCN(CC1)c1ccc(Nc2c(c(C)nc3ccccc23)-c2ccccc2)cc1
InChI Key InChIKey=YRMKSXYNMSJIBT-UHFFFAOYSA-N
Data  4 KI
  Tab Delimited (TSV)   2D SDfile   Computed 3D by Vconf -m prep SDfile
Find this compound or compounds like it in BindingDB:
Activity Spreadsheet -- Enzyme Inhibition Constant Data from BindingDB
Found 4 hits for monomerid = 50196130
TargetAlpha-2C adrenergic receptor(Homo sapiens (Human))
Timisoara Of The Romanian Academy
Curated by ChEMBL
LigandPNGBDBM50196130((2-methyl-3-phenylquinolin-4-yl)-[4-(4-methylpiper...)
Affinity DataKi:  35.0nM. Assay description: Binding affinity to human cloned Alpha-2C adrenergic receptor
In DepthDetails ArticlePubMed
TargetAlpha-2C adrenergic receptor(Homo sapiens (Human))
Timisoara Of The Romanian Academy
Curated by ChEMBL
LigandPNGBDBM50196130((2-methyl-3-phenylquinolin-4-yl)-[4-(4-methylpiper...)
Affinity DataKi:  35nM. Assay description: Displacement of [3H]rauwolscine from human ADRA2C expressed in S115 cells
In DepthDetails ArticlePubMed
TargetAlpha-2A adrenergic receptor(Homo sapiens (Human))
Juvantia Pharma
Curated by ChEMBL
LigandPNGBDBM50196130((2-methyl-3-phenylquinolin-4-yl)-[4-(4-methylpiper...)
Affinity DataKi:  1.70E+3nM. Assay description: Displacement of [3H]rauwolscine from human ADRA2A expressed in S115 cells
In DepthDetails ArticlePubMed
TargetAlpha-2B adrenergic receptor(Homo sapiens (Human))
Juvantia Pharma
Curated by ChEMBL
LigandPNGBDBM50196130((2-methyl-3-phenylquinolin-4-yl)-[4-(4-methylpiper...)
Affinity DataKi: >1.00E+4nM. Assay description: Displacement of [3H]rauwolscine from human ADRA2B expressed in S115 cells
In DepthDetails ArticlePubMed