BDBM50196159 4-[2-[(2,1,3-benzothiadiazol-4-ylsulfonyl)amino]-4-bromobenzoyl]-morpholine::CHEMBL387194
SMILES Brc1ccc(C(=O)N2CCOCC2)c(NS(=O)(=O)c2cccc3nsnc23)c1
InChI Key InChIKey=SPMKQIKDPCGGCB-UHFFFAOYSA-N
Data  1 KI
  Tab Delimited (TSV)   2D SDfile   Computed 3D by Vconf -m prep SDfile
Find this compound or compounds like it in BindingDB:
Activity Spreadsheet -- Enzyme Inhibition Constant Data from BindingDB
Found 1 hit for monomerid = 50196159
TargetCholecystokinin receptor type A(Homo sapiens (Human))
Johnson And Johnson Pharmaceutical Research And Development
Curated by ChEMBL
LigandPNGBDBM50196159(4-[2-[(2,1,3-benzothiadiazol-4-ylsulfonyl)amino]-4...)
Affinity DataKi: >1.00E+4nM. Assay description: Displacement of [125I]CCK-8S from human CCK1R
In DepthDetails ArticlePubMed