BDBM50196244 CHEMBL3896065
SMILES CC(C)C[C@H](NC(=O)[C@H](CO)NC(=O)[C@@H](NC(=O)[C@@H]1CCCN1C(=O)[C@@H](N)CCCCN)C(C)C)C(=O)N[C@@H](CO)C(=O)N[C@@H](Cc1ccc(cc1)[N+]([O-])=O)C(=O)N[C@@H](CCCNC(N)=N)C(=O)N[C@@H](CO)C(=O)N[C@@H](C)C(=O)NCCCC[C@H](NC(=O)[C@@H]1CSSC[C@H](NC(=O)[C@H](Cc2ccc3ccccc3c2)NC(=O)[C@H](CCCNC(N)=N)NC(=O)[C@@H](N)CCCNC(N)=N)C(=O)N[C@@H](Cc2ccc(O)cc2)C(=O)N[C@@H](CCCNC(N)=N)C(=O)N[C@@H](CCCCN)C(=O)N[C@H](CCCCN)C(=O)N2CCC[C@H]2C(=O)N[C@@H](Cc2ccc(O)cc2)C(=O)N[C@@H](CCCNC(N)=N)C(=O)N[C@@H](CCCNC(N)=N)C(=O)N1)C(O)=O
InChI Key InChIKey=DFLVOQFANLVCQV-ZNJXPDDDSA-N
Data  1 IC50  1 EC50
  Tab Delimited (TSV)   2D SDfile   Computed 3D by Vconf -m prep SDfile
Find this compound or compounds like it in BindingDB:
Activity Spreadsheet -- Enzyme Inhibition Constant Data from BindingDB
Found 2 hits for monomerid = 50196244
TargetC-X-C chemokine receptor type 4(Homo sapiens (Human))
Universit£
Curated by ChEMBL
LigandPNGBDBM50196244(CHEMBL3896065)
Affinity DataEC50:  62nM. Assay description: Agonist activity at HA-tagged human CXCR4 receptor expressed in HEK293 cells co-transfected with Galphai1-91-RlucII, Gbeta1, and GFP10-G-gamma1 incub...
In DepthDetails ArticlePubMed
TargetC-X-C chemokine receptor type 4(Homo sapiens (Human))
Universit£
Curated by ChEMBL
LigandPNGBDBM50196244(CHEMBL3896065)
Affinity DataIC50:  109nM. Assay description: Displacement of [125I]-CXCL12 from HA-tagged human recombinant CXCR4 expressed in HEK293 cells incubated for 1 hr by gamma-radiation counting analysi...
In DepthDetails ArticlePubMed