BDBM50196250 2-(1-(3-(6-benzoyl-1-propylnaphthalen-2-yloxy)propyl)-1H-indol-4-yloxy)-2-methylpropanoic acid::2-[(1-{3-[(6-BENZOYL-1-PROPYL-2-NAPHTHYL)OXY]PROPYL}-1H-INDOL-4-YL)OXY]-2-METHYLPROPANOIC ACID::CHEMBL216395
SMILES CCCc1c(OCCCn2ccc3c(OC(C)(C)C(O)=O)cccc23)ccc2cc(ccc12)C(=O)c1ccccc1
InChI Key InChIKey=PTLLEIWUBIYUFA-UHFFFAOYSA-N
Data  3 EC50
PDB links: 1 PDB ID matches this monomer.
  Tab Delimited (TSV)   2D SDfile   Computed 3D by Vconf -m prep SDfile
Find this compound or compounds like it in BindingDB:
Activity Spreadsheet -- Enzyme Inhibition Constant Data from BindingDB
Found 3 hits for monomerid = 50196250
TargetPeroxisome proliferator-activated receptor delta(Homo sapiens (Human))
National Health Research Institutes
Curated by ChEMBL
LigandPNGBDBM50196250(2-(1-(3-(6-benzoyl-1-propylnaphthalen-2-yloxy)prop...)
Affinity DataEC50:  4.30E+3nM. Assay description: Activity at human PPAR delta in Huh7 cells by transactivation assay
In DepthDetails ArticlePubMed
TargetPeroxisome proliferator-activated receptor alpha(Homo sapiens (Human))
National Health Research Institutes
Curated by ChEMBL
LigandPNGBDBM50196250(2-(1-(3-(6-benzoyl-1-propylnaphthalen-2-yloxy)prop...)
Affinity DataEC50:  282nM. Assay description: Activity at human PPAR alpha in Huh7 cells by transactivation assay
In DepthDetails ArticlePubMed
TargetPeroxisome proliferator-activated receptor gamma(Homo sapiens (Human))
National Health Research Institutes
Curated by ChEMBL
LigandPNGBDBM50196250(2-(1-(3-(6-benzoyl-1-propylnaphthalen-2-yloxy)prop...)
Affinity DataEC50:  210nM. Assay description: Activity at human PPAR gamma in Huh7 cells by transactivation assay