BDBM50196264 CHEMBL3983197
SMILES CC(C)C[C@H](NC(=O)[C@H](CO)NC(=O)[C@H](C(C)C)N(C)C(=O)[C@@H]1CCCN1C(=O)[C@@H](N)CCCCN)C(=O)N[C@@H](CO)C(=O)N[C@@H](Cc1ccc(O)cc1)C(=O)N[C@@H](CCCNC(N)=N)C(=O)N[C@@H](CO)C(=O)N[C@@H](C)C(=O)NCCCC[C@H](NC(=O)[C@@H]1CSSC[C@H](NC(=O)[C@H](Cc2ccc3ccccc3c2)NC(=O)[C@H](CCCNC(N)=N)NC(=O)[C@@H](N)CCCNC(N)=N)C(=O)N[C@@H](Cc2ccc(O)cc2)C(=O)N[C@@H](CCCNC(N)=N)C(=O)N[C@@H](CCCCN)C(=O)N[C@H](CCCCN)C(=O)N2CCC[C@H]2C(=O)N[C@@H](Cc2ccc(O)cc2)C(=O)N[C@@H](CCCNC(N)=N)C(=O)N[C@@H](CCCNC(N)=N)C(=O)N1)C(O)=O
InChI Key InChIKey=OCXADRAOSVWAKR-QHEUAXHBSA-N
Data  1 IC50
  Tab Delimited (TSV)   2D SDfile   Computed 3D by Vconf -m prep SDfile
Find this compound or compounds like it in BindingDB:
Activity Spreadsheet -- Enzyme Inhibition Constant Data from BindingDB
Found 1 hit for monomerid = 50196264
TargetC-X-C chemokine receptor type 4(Homo sapiens (Human))
Universit£
Curated by ChEMBL
LigandPNGBDBM50196264(CHEMBL3983197)
Affinity DataIC50:  127nM. Assay description: Displacement of [125I]-CXCL12 from HA-tagged human recombinant CXCR4 expressed in HEK293 cells incubated for 1 hr by gamma-radiation counting analysi...
In DepthDetails ArticlePubMed