BDBM50196325 CHEMBL3908362
SMILES Fc1cc(Oc2cccnc2)cc(c1)N1Cc2ccccc2S1(=O)=O
InChI Key InChIKey=GTUWFJSMHUOHTQ-UHFFFAOYSA-N
Data  1 IC50  4 EC50
  Tab Delimited (TSV)   2D SDfile   Computed 3D by Vconf -m prep SDfile
Find this compound or compounds like it in BindingDB:
Activity Spreadsheet -- Enzyme Inhibition Constant Data from BindingDB
Found 5 hits for monomerid = 50196325
TargetFree fatty acid receptor 4(Homo sapiens (Human))
University Of Southern Denmark
Curated by ChEMBL
LigandPNGBDBM50196325(CHEMBL3908362)
Affinity DataEC50:  437nM. Assay description: Agonist activity at C-terminal YFP-tagged human FFA4 expressed in HEK293 cells in presence of coelentrazine h by BRET based beta-arrestin-2 interacti...
In DepthDetails ArticlePubMed
TargetFree fatty acid receptor 4(Mus musculus)
University Of Southern Denmark
Curated by ChEMBL
LigandPNGBDBM50196325(CHEMBL3908362)
Affinity DataEC50:  83nM. Assay description: Agonist activity mouse FFA4 by Gq-dependent calcium mobilization assay
In DepthDetails ArticlePubMed
TargetFree fatty acid receptor 1(Homo sapiens (Human))
University Of Southern Denmark
Curated by ChEMBL
LigandPNGBDBM50196325(CHEMBL3908362)
Affinity DataIC50: <1.00E+5nM. Assay description: Antagonist activity against human FFA1 expressed in human Flp-In T-REx293 cells assessed as as reduction in TUG424-induced response by Fura2-AM dye b...
In DepthDetails ArticlePubMed
TargetFree fatty acid receptor 4(Homo sapiens (Human))
University Of Southern Denmark
Curated by ChEMBL
LigandPNGBDBM50196325(CHEMBL3908362)
Affinity DataEC50:  302nM. Assay description: Agonist activity at human FFA4 expressed in human Flp-In T-REx293 cells by Fura2-AM dye based calcium mobilization assay
In DepthDetails ArticlePubMed
TargetFree fatty acid receptor 4(Homo sapiens (Human))
University Of Southern Denmark
Curated by ChEMBL
LigandPNGBDBM50196325(CHEMBL3908362)
Affinity DataEC50:  182nM. Assay description: Agonist activity at human FFA4 expressed in CHO/NFAT-BLA cells assessed as effect on intracellular calcium concentration by Fluo-4 AM dye based FLIPR...
In DepthDetails ArticlePubMed