BDBM50196429 CHEMBL3896533
SMILES CNC(=N)NCCC[C@H](NC(=O)[C@H](CC(C)C)NC(=O)NNC(=O)[C@H](Cc1ccccc1)NC(=O)[C@@H](NC(=O)[C@H](CC(N)=O)NC(=O)CNC(=O)[C@@H](Cc1ccc(O)cc1)NC(C)=O)[C@@H](C)O)C(=O)N[C@@H](Cc1c[nH]c2ccccc12)C(N)=O
InChI Key InChIKey=YKNXJAQUXMTJGB-INAOFNLRSA-N
Data  2 EC50
  Tab Delimited (TSV)   2D SDfile   Computed 3D by Vconf -m prep SDfile
Find this compound or compounds like it in BindingDB:
Activity Spreadsheet -- Enzyme Inhibition Constant Data from BindingDB
Found 2 hits for monomerid = 50196429
TargetKiSS-1 receptor(Homo sapiens (Human))
Takeda Pharmaceutical
Curated by ChEMBL
LigandPNGBDBM50196429(CHEMBL3896533)
Affinity DataEC50:  5.20nM. Assay description: Agonist activity at human KISS1R expressed in CHO/dhfr cells assessed as increase in intracellular Ca2+ levels measured for 180 secs by Fluo 3-AM dye...
In DepthDetails ArticlePubMed
TargetKiSS-1 receptor(Rattus norvegicus)
Takeda Pharmaceutical
Curated by ChEMBL
LigandPNGBDBM50196429(CHEMBL3896533)
Affinity DataEC50:  46nM. Assay description: Agonist activity at rat KISS1R expressed in CHO/dhfr cells assessed as increase in intracellular Ca2+ levels measured for 180 secs by Fluo 3-AM dye b...
In DepthDetails ArticlePubMed