BDBM50196588 CHEMBL399749::N-((2S,3R)-4-(3-methoxybenzylamino)-3-hydroxy-1-phenylbutan-2-yl)-5-(phenylsulfonyl)pentanamide
SMILES COc1cccc(CNC[C@@H](O)[C@H](Cc2ccccc2)NC(=O)CCCCS(=O)(=O)c2ccccc2)c1
InChI Key InChIKey=UQJVWEWEJOEPTN-WUFINQPMSA-N
Data  2 IC50
  Tab Delimited (TSV)   2D SDfile   Computed 3D by Vconf -m prep SDfile
Find this compound or compounds like it in BindingDB:
Activity Spreadsheet -- Enzyme Inhibition Constant Data from BindingDB
Found 2 hits for monomerid = 50196588
TargetCathepsin D(Homo sapiens (Human))
Pfizer
Curated by ChEMBL
LigandPNGBDBM50196588(CHEMBL399749 | N-((2S,3R)-4-(3-methoxybenzylamino)...)
Affinity DataIC50:  1.12E+4nM. Assay description: Inhibition of human recombinant cathepsin D
In DepthDetails ArticlePubMed
TargetBeta-secretase 1(Homo sapiens (Human))
Pfizer
Curated by ChEMBL
LigandPNGBDBM50196588(CHEMBL399749 | N-((2S,3R)-4-(3-methoxybenzylamino)...)
Affinity DataIC50: >2.00E+4nM. Assay description: Inhibition of human recombinant BACE
In DepthDetails ArticlePubMed