BDBM50196654 12-(3-adamantan-1-yl-ureido)-dodecanoic acid propyl ester::CHEMBL224359
SMILES CCCOC(=O)CCCCCCCCCCCNC(=O)NC12CC3CC(CC(C3)C1)C2
InChI Key InChIKey=NXGNORLTGJZGBQ-UHFFFAOYSA-N
Data  3 IC50
  Tab Delimited (TSV)   2D SDfile   Computed 3D by Vconf -m prep SDfile
Find this compound or compounds like it in BindingDB:
Activity Spreadsheet -- Enzyme Inhibition Constant Data from BindingDB
Found 3 hits for monomerid = 50196654
TargetBifunctional epoxide hydrolase 2(Mus musculus (Mouse))
Department Of Entomology And University Of California Davis Cancer Center
Curated by ChEMBL
LigandPNGBDBM50196654(12-(3-adamantan-1-yl-ureido)-dodecanoic acid propy...)
Affinity DataIC50:  50nM. Assay description: Inhibition of mouse soluble epoxide hydrolase by spectrometric based assay
In DepthDetails ArticlePubMed
TargetBifunctional epoxide hydrolase 2(Homo sapiens (Human))
Department Of Entomology And University Of California Davis Cancer Center
Curated by ChEMBL
LigandPNGBDBM50196654(12-(3-adamantan-1-yl-ureido)-dodecanoic acid propy...)
Affinity DataIC50:  100nM. Assay description: Inhibition of human soluble epoxide hydrolase by spectrometric based assay
In DepthDetails ArticlePubMed
TargetBifunctional epoxide hydrolase 2(Homo sapiens (Human))
Department Of Entomology And University Of California Davis Cancer Center
Curated by ChEMBL
LigandPNGBDBM50196654(12-(3-adamantan-1-yl-ureido)-dodecanoic acid propy...)
Affinity DataIC50:  1nM. Assay description: Inhibition of human soluble epoxide hydrolase by fluorescent based assay
In DepthDetails ArticlePubMed