BDBM50197293 CHEMBL3968275
SMILES Nc1ncnc2n3[C@@H]4O[C@H](COS(=O)(=O)NC(=O)[C@@H](O)CCCc3nc12)[C@@H](O)[C@H]4O
InChI Key InChIKey=JOZCULNDKZPWOC-WERHYGNASA-N
Data  1 IC50
  Tab Delimited (TSV)   2D SDfile   Computed 3D by Vconf -m prep SDfile
Find this compound or compounds like it in BindingDB:
Activity Spreadsheet -- Enzyme Inhibition Constant Data from BindingDB
Found 1 hit for monomerid = 50197293
TargetYersiniabactin biosynthetic protein(Yersinia pestis)
Weill Cornell Graduate School Of Medical Sciences
Curated by ChEMBL
LigandPNGBDBM50197293(CHEMBL3968275)
Affinity DataIC50: >1.00E+6nM. Assay description: Inhibition of recombinant Yersinia pestis C-terminal His6-tagged HMWP2 cysteine adenylation domain (1 to 1491 residues) expressed in Escherichia coli...
In DepthDetails ArticlePubMed