BDBM50197494 CHEMBL220253::N-benzyl-N'-hydroxy-2-isobutyl-malonamide::N1-benzyl-N3-hydroxy-2-isobutylmalonamide
SMILES CC(C)CC(C(=O)NO)C(=O)NCc1ccccc1
InChI Key InChIKey=BOQZRPQZGWWCDJ-UHFFFAOYSA-N
Data  2 IC50
  Tab Delimited (TSV)   2D SDfile   Computed 3D by Vconf -m prep SDfile
Find this compound or compounds like it in BindingDB:
Activity Spreadsheet -- Enzyme Inhibition Constant Data from BindingDB
Found 2 hits for monomerid = 50197494
TargetM1 family aminopeptidase(Plasmodium falciparum (isolate FcB1 / Columbia))
University Of Lille
Curated by ChEMBL
LigandPNGBDBM50197494(CHEMBL220253 | N-benzyl-N'-hydroxy-2-isobutyl-malo...)
Affinity DataIC50:  495nM. Assay description: Inhibition of Plasmodium falciparum FcB1 M1 aminopeptidase
In DepthDetails ArticlePubMed
TargetAminopeptidase N(Sus scrofa (Pig))
University Of Lille 2
Curated by ChEMBL
LigandPNGBDBM50197494(CHEMBL220253 | N-benzyl-N'-hydroxy-2-isobutyl-malo...)
Affinity DataIC50:  590nM. Assay description: Inhibition of microsomal neural aminopeptidase in pig kidney
In DepthDetails ArticlePubMed