BDBM50197505 2-(3-phenoxybenzyl)-N1-hydroxy-N3-(4-phenylbutyl)malonamide::CHEMBL376199::N-hydroxy-2-(3-phenoxy-benzyl)-N'-(4-phenyl-butyl)-malonamide
SMILES ONC(=O)C(Cc1cccc(Oc2ccccc2)c1)C(=O)NCCCCc1ccccc1
InChI Key InChIKey=DTXSHIHLPJTPHO-UHFFFAOYSA-N
Data  2 IC50
  Tab Delimited (TSV)   2D SDfile   Computed 3D by Vconf -m prep SDfile
Find this compound or compounds like it in BindingDB:
Activity Spreadsheet -- Enzyme Inhibition Constant Data from BindingDB
Found 2 hits for monomerid = 50197505
TargetM1 family aminopeptidase(Plasmodium falciparum (isolate FcB1 / Columbia))
University Of Lille
Curated by ChEMBL
LigandPNGBDBM50197505(2-(3-phenoxybenzyl)-N1-hydroxy-N3-(4-phenylbutyl)m...)
Affinity DataIC50:  225nM. Assay description: Inhibition of Plasmodium falciparum FcB1 M1 aminopeptidase
In DepthDetails ArticlePubMed
TargetAminopeptidase N(Sus scrofa (Pig))
University Of Lille 2
Curated by ChEMBL
LigandPNGBDBM50197505(2-(3-phenoxybenzyl)-N1-hydroxy-N3-(4-phenylbutyl)m...)
Affinity DataIC50: >1.00E+4nM. Assay description: Inhibition of microsomal neural aminopeptidase in pig kidney
In DepthDetails ArticlePubMed