BDBM50197578 CHEMBL3919256
SMILES [H][C@@]12C[C@@]([H])([C@H](C)[C@H](C1)NC(=O)[C@H](CC1CCCCC1)NS(=O)(=O)N[C@@H](CCCCN)C(O)=O)C2(C)C
InChI Key InChIKey=CVNHXUCHQVVMEP-QOLIXYQJSA-N
Data  1 IC50
  Tab Delimited (TSV)   2D SDfile   Computed 3D by Vconf -m prep SDfile
Find this compound or compounds like it in BindingDB:
Activity Spreadsheet -- Enzyme Inhibition Constant Data from BindingDB
Found 1 hit for monomerid = 50197578
TargetCarboxypeptidase B2(Homo sapiens (Human))
Sanofi R & D
Curated by ChEMBL
LigandPNGBDBM50197578(CHEMBL3919256)
Affinity DataIC50:  130nM. Assay description: Inhibition of activated human plasma TAFI incubated for 15 mins by chromogenic assay
In DepthDetails ArticlePubMed