BDBM50197742 CHEMBL3957440
SMILES CNS(=O)(=O)c1ccc(N(C)C)c(Nc2ncnc3[nH]c4ccccc4c23)c1
InChI Key InChIKey=GLNYHRIHVCJSGA-UHFFFAOYSA-N
Data  1 IC50
  Tab Delimited (TSV)   2D SDfile   Computed 3D by Vconf -m prep SDfile
Find this compound or compounds like it in BindingDB:
Activity Spreadsheet -- Enzyme Inhibition Constant Data from BindingDB
Found 1 hit for monomerid = 50197742
TargetSerine/threonine-protein kinase TNNI3K(Homo sapiens (Human))
Glaxosmithkline
Curated by ChEMBL
LigandPNGBDBM50197742(CHEMBL3957440)
Affinity DataIC50:  50nM. Assay description: Displacement of 5-({[2-({[3-({4-[(5-hydroxy-2-methylphenyl)amino]-2-pyrimidinyl}amino)phenyl]carbonyl}amino)-ethyl]amino}carbonyl)-2-(6-hydroxy-3-oxo...
In DepthDetails ArticlePubMed