BDBM50197818 CHEMBL3944032
SMILES COc1ccc(OCc2cn(nn2)-c2ccc(cc2)S(N)(=O)=O)cc1
InChI Key InChIKey=WZONQFASBANDEJ-UHFFFAOYSA-N
Data  4 KI
  Tab Delimited (TSV)   2D SDfile   Computed 3D by Vconf -m prep SDfile
Find this compound or compounds like it in BindingDB:
Activity Spreadsheet -- Enzyme Inhibition Constant Data from BindingDB
Found 4 hits for monomerid = 50197818
TargetCarbonic anhydrase 12(Homo sapiens (Human))
Universit£
Curated by ChEMBL
LigandPNGBDBM50197818(CHEMBL3944032)
Affinity DataKi:  1nM. Assay description: Inhibition of human carbonic anhydrase 12 pre-incubated for 15 mins by stopped flow carbon dioxide hydrase assay
In DepthDetails ArticlePubMed
TargetCarbonic anhydrase 2(Homo sapiens (Human))
Universit£
Curated by ChEMBL
LigandPNGBDBM50197818(CHEMBL3944032)
Affinity DataKi:  4.30nM. Assay description: Inhibition of human carbonic anhydrase 2 pre-incubated for 15 mins by stopped flow carbon dioxide hydrase assay
In DepthDetails ArticlePubMed
TargetCarbonic anhydrase 9(Homo sapiens (Human))
Universit£
Curated by ChEMBL
LigandPNGBDBM50197818(CHEMBL3944032)
Affinity DataKi:  14nM. Assay description: Inhibition of human carbonic anhydrase 9 pre-incubated for 15 mins by stopped flow carbon dioxide hydrase assay
In DepthDetails ArticlePubMed
TargetCarbonic anhydrase 1(Homo sapiens (Human))
Universit£
Curated by ChEMBL
LigandPNGBDBM50197818(CHEMBL3944032)
Affinity DataKi:  513nM. Assay description: Inhibition of human carbonic anhydrase 1 pre-incubated for 15 mins by stopped flow carbon dioxide hydrase assay
In DepthDetails ArticlePubMed