BDBM50197914 CHEMBL375556::N-(1-(4-chlorobenzyl)pyrrolidin-3-yl)isoquinolin-5-amine::N-[1-(4-chlorobenzyl)-3-pyrrolidyl]-N-(5-isoquinolyl)amine
SMILES Clc1ccc(CN2CCC(C2)Nc2cccc3cnccc23)cc1
InChI Key InChIKey=UGWBCYQPCXKMGF-UHFFFAOYSA-N
Data  2 IC50
  Tab Delimited (TSV)   2D SDfile   Computed 3D by Vconf -m prep SDfile
Find this compound or compounds like it in BindingDB:
Activity Spreadsheet -- Enzyme Inhibition Constant Data from BindingDB
Found 2 hits for monomerid = 50197914
TargetC-C chemokine receptor type 2(Homo sapiens (Human))
Kirin Brewery
Curated by ChEMBL
LigandPNGBDBM50197914(CHEMBL375556 | N-(1-(4-chlorobenzyl)pyrrolidin-3-y...)
Affinity DataIC50:  1.10E+4nM. Assay description: Inhibition of MCP1-induced chemotaxis in U937 cells overexpressing CCR2
In DepthDetails ArticlePubMed
TargetRho-associated protein kinase 1/2(Homo sapiens (Human))
Kirin Brewery
Curated by ChEMBL
LigandPNGBDBM50197914(CHEMBL375556 | N-(1-(4-chlorobenzyl)pyrrolidin-3-y...)
Affinity DataIC50:  65nM. Assay description: Inhibition of Rho kinase
In DepthDetails ArticlePubMed