BDBM50198036 ((R)-1-{4-[2-(4-methoxy-phenyl)-ethyl]-benzenesulfonylamino}-2-methyl-propyl)-phosphonic acid::CHEMBL228141
SMILES COc1ccc(CCc2ccc(cc2)S(=O)(=O)N[C@@H](C(C)C)P(O)(O)=O)cc1
InChI Key InChIKey=AGSXHHFUSDGSSO-LJQANCHMSA-N
Data  6 IC50
  Tab Delimited (TSV)   2D SDfile   Computed 3D by Vconf -m prep SDfile
Find this compound or compounds like it in BindingDB:
Activity Spreadsheet -- Enzyme Inhibition Constant Data from BindingDB
Found 6 hits for monomerid = 50198036
TargetMatrix metalloproteinase-9(Homo sapiens (Human))
Università
Curated by ChEMBL
LigandPNGBDBM50198036(((R)-1-{4-[2-(4-methoxy-phenyl)-ethyl]-benzenesulf...)
Affinity DataIC50:  680nM. Assay description: Inhibition of human recombinant MMP9 expressed in mouse myeloma cells
In DepthDetails ArticlePubMed
TargetMatrix metalloproteinase-14(Homo sapiens (Human))
Università
Curated by ChEMBL
LigandPNGBDBM50198036(((R)-1-{4-[2-(4-methoxy-phenyl)-ethyl]-benzenesulf...)
Affinity DataIC50:  4.00E+4nM. Assay description: Inhibition of MMP14
In DepthDetails ArticlePubMed
TargetMatrilysin(Homo sapiens (Human))
Università
Curated by ChEMBL
LigandPNGBDBM50198036(((R)-1-{4-[2-(4-methoxy-phenyl)-ethyl]-benzenesulf...)
Affinity DataIC50:  1.30E+5nM. Assay description: Inhibition of MMP7
In DepthDetails ArticlePubMed
Target72 kDa type IV collagenase(Homo sapiens (Human))
Università
Curated by ChEMBL
LigandPNGBDBM50198036(((R)-1-{4-[2-(4-methoxy-phenyl)-ethyl]-benzenesulf...)
Affinity DataIC50:  790nM. Assay description: Inhibition of human recombinant MMP2 expressed in mouse myeloma cells
In DepthDetails ArticlePubMed
TargetCollagenase 3(Homo sapiens (Human))
Università
Curated by ChEMBL
LigandPNGBDBM50198036(((R)-1-{4-[2-(4-methoxy-phenyl)-ethyl]-benzenesulf...)
Affinity DataIC50:  480nM. Assay description: Inhibition of MMP13
In DepthDetails ArticlePubMed
TargetNeutrophil collagenase(Homo sapiens (Human))
Università
Curated by ChEMBL
LigandPNGBDBM50198036(((R)-1-{4-[2-(4-methoxy-phenyl)-ethyl]-benzenesulf...)
Affinity DataIC50:  110nM. Assay description: Inhibition of MMP8
In DepthDetails ArticlePubMed