BDBM50198038 CHEMBL227824::[(R)-1-(4'-ethoxy-biphenyl-4-sulfonylamino)-2-methyl-propyl]-phosphonic acid
SMILES CCOc1ccc(cc1)-c1ccc(cc1)S(=O)(=O)N[C@@H](C(C)C)P(O)(O)=O
InChI Key InChIKey=RVKPGECPCLBLDB-GOSISDBHSA-N
Data  8 IC50
  Tab Delimited (TSV)   2D SDfile   Computed 3D by Vconf -m prep SDfile
Find this compound or compounds like it in BindingDB:
Activity Spreadsheet -- Enzyme Inhibition Constant Data from BindingDB
Found 8 hits for monomerid = 50198038
TargetMatrix metalloproteinase-9(Homo sapiens (Human))
Università
Curated by ChEMBL
LigandPNGBDBM50198038(CHEMBL227824 | [(R)-1-(4'-ethoxy-biphenyl-4-sulfon...)
Affinity DataIC50:  0.560nM. Assay description: Inhibition of human recombinant MMP9 expressed in mouse myeloma cells
In DepthDetails ArticlePubMed
TargetMatrix metalloproteinase-14(Homo sapiens (Human))
Università
Curated by ChEMBL
LigandPNGBDBM50198038(CHEMBL227824 | [(R)-1-(4'-ethoxy-biphenyl-4-sulfon...)
Affinity DataIC50:  11nM. Assay description: Inhibition of MMP14
In DepthDetails ArticlePubMed
TargetNeutrophil collagenase(Homo sapiens (Human))
Università
Curated by ChEMBL
LigandPNGBDBM50198038(CHEMBL227824 | [(R)-1-(4'-ethoxy-biphenyl-4-sulfon...)
Affinity DataIC50:  0.370nM. Assay description: Inhibition of MMP8
In DepthDetails ArticlePubMed
TargetInterstitial collagenase(Homo sapiens (Human))
Università
Curated by ChEMBL
LigandPNGBDBM50198038(CHEMBL227824 | [(R)-1-(4'-ethoxy-biphenyl-4-sulfon...)
Affinity DataIC50:  450nM. Assay description: Inhibition of MMP1
In DepthDetails ArticlePubMed
Target72 kDa type IV collagenase(Homo sapiens (Human))
Università
Curated by ChEMBL
LigandPNGBDBM50198038(CHEMBL227824 | [(R)-1-(4'-ethoxy-biphenyl-4-sulfon...)
Affinity DataIC50:  0.390nM. Assay description: Inhibition of human recombinant MMP2 expressed in mouse myeloma cells
In DepthDetails ArticlePubMed
TargetStromelysin-1(Homo sapiens (Human))
Università
Curated by ChEMBL
LigandPNGBDBM50198038(CHEMBL227824 | [(R)-1-(4'-ethoxy-biphenyl-4-sulfon...)
Affinity DataIC50:  12nM. Assay description: Inhibition of MMP3
In DepthDetails ArticlePubMed
TargetMatrilysin(Homo sapiens (Human))
Università
Curated by ChEMBL
LigandPNGBDBM50198038(CHEMBL227824 | [(R)-1-(4'-ethoxy-biphenyl-4-sulfon...)
Affinity DataIC50:  450nM. Assay description: Inhibition of MMP7
In DepthDetails ArticlePubMed
TargetCollagenase 3(Homo sapiens (Human))
Università
Curated by ChEMBL
LigandPNGBDBM50198038(CHEMBL227824 | [(R)-1-(4'-ethoxy-biphenyl-4-sulfon...)
Affinity DataIC50:  1.10nM. Assay description: Inhibition of MMP13
In DepthDetails ArticlePubMed