BDBM50198134 CHEMBL395289::N-{[3,5-bis(trifluoromethyl)phenyl]methyl}-4-[(1S,5'R)-5'-methylspiro[indene-1,4'-piperidine]-1'-yl]-2-{2-[2-(thiophen-2-yl)acetamido]-1,3-thiazol-4-yl}butanamide
SMILES C[C@H]1CN(CCC(C(=O)NCc2cc(cc(c2)C(F)(F)F)C(F)(F)F)c2csc(NC(=O)Cc3cccs3)n2)CC[C@]11C=Cc2ccccc12
InChI Key InChIKey=SSLRKYCBEPQPOB-DHYFXEGDSA-N
Data  2 IC50
  Tab Delimited (TSV)   2D SDfile   Computed 3D by Vconf -m prep SDfile
Find this compound or compounds like it in BindingDB:
Activity Spreadsheet -- Enzyme Inhibition Constant Data from BindingDB
Found 2 hits for monomerid = 50198134
TargetC-C chemokine receptor type 2(Homo sapiens (Human))
Merck Research Laboratories
Curated by ChEMBL
LigandPNGBDBM50198134(CHEMBL395289 | N-{[3,5-bis(trifluoromethyl)phenyl]...)
Affinity DataIC50:  23nM. Assay description: Displacement of [125I]MCP1 from human CCR2 expressed in monocytes
In DepthDetails ArticlePubMed
TargetC-C chemokine receptor type 2(Mus musculus)
Merck Research Laboratories
Curated by ChEMBL
LigandPNGBDBM50198134(CHEMBL395289 | N-{[3,5-bis(trifluoromethyl)phenyl]...)
Affinity DataIC50:  81nM. Assay description: Displacement of [125I]MCP1 from mouse CCR2 expressed in monocytes
In DepthDetails ArticlePubMed