BDBM50198252 2-(3,4-dimethylphenyl)-3-(3-methoxybenzyloxy)thiazolidin-4-one::CHEMBL385933
SMILES COc1cccc(CON2C(SCC2=O)c2ccc(C)c(C)c2)c1
InChI Key InChIKey=TWHRIRGWGPNMHN-UHFFFAOYSA-N
Data  1 IC50
  Tab Delimited (TSV)   2D SDfile   Computed 3D by Vconf -m prep SDfile
Find this compound or compounds like it in BindingDB:
Activity Spreadsheet -- Enzyme Inhibition Constant Data from BindingDB
Found 1 hit for monomerid = 50198252
TargetPotassium voltage-gated channel subfamily A member 5(Homo sapiens (Human))
Procter And Gamble Pharmaceuticals
Curated by ChEMBL
LigandPNGBDBM50198252(2-(3,4-dimethylphenyl)-3-(3-methoxybenzyloxy)thiaz...)
Affinity DataIC50:  269nM. Assay description: Inhibition of Kv1.5 mediated ultra-rapid delayed rectifier current Ikur in human atrial cells
In DepthDetails ArticlePubMed