BDBM50198254 2-(3,4-dimethylphenyl)-3-(2-methoxybenzyloxy)thiazolidin-4-one::CHEMBL424912
SMILES COc1ccccc1CON1C(SCC1=O)c1ccc(C)c(C)c1
InChI Key InChIKey=VACLSIDPOVVRAM-UHFFFAOYSA-N
Data  1 IC50
  Tab Delimited (TSV)   2D SDfile   Computed 3D by Vconf -m prep SDfile
Find this compound or compounds like it in BindingDB:
Activity Spreadsheet -- Enzyme Inhibition Constant Data from BindingDB
Found 1 hit for monomerid = 50198254
TargetPotassium voltage-gated channel subfamily A member 5(Homo sapiens (Human))
Procter And Gamble Pharmaceuticals
Curated by ChEMBL
LigandPNGBDBM50198254(2-(3,4-dimethylphenyl)-3-(2-methoxybenzyloxy)thiaz...)
Affinity DataIC50:  177nM. Assay description: Inhibition of Kv1.5 mediated ultra-rapid delayed rectifier current Ikur in human atrial cells
In DepthDetails ArticlePubMed