BDBM50198425 1-(2,4-dichlorobenzyl)-N-(5-(diethylamino)pentan-2-yl)-1H-pyrazolo[3,4-b]pyridin-6-amine::CHEMBL396787
SMILES CCN(CC)CCCC(C)Nc1ccc2cnn(Cc3ccc(Cl)cc3Cl)c2n1
InChI Key InChIKey=WVFBWTWTRQHWIC-UHFFFAOYSA-N
Data  1 IC50
  Tab Delimited (TSV)   2D SDfile   Computed 3D by Vconf -m prep SDfile
Find this compound or compounds like it in BindingDB:
Activity Spreadsheet -- Enzyme Inhibition Constant Data from BindingDB
Found 1 hit for monomerid = 50198425
TargetC-C chemokine receptor type 4(Homo sapiens (Human))
Bristol-Myers Squibb Pharmaceutical Research Institute
Curated by ChEMBL
LigandPNGBDBM50198425(1-(2,4-dichlorobenzyl)-N-(5-(diethylamino)pentan-2...)
Affinity DataIC50:  280nM. Assay description: Displacement of [125I]MDC from human CCR4 expressed in HEK293 cells
In DepthDetails ArticlePubMed