BDBM50198525 5-cyclohexyl-1-(2,4-dichlorophenyl)-2-(4-fluorophenyl)-3-methyl-6,7-dihydro-1H-pyrrolo[3,2-c]pyridin-4(5H)-one::CHEMBL396799
SMILES Cc1c2c(CCN(C3CCCCC3)C2=O)n(c1-c1ccc(F)cc1)-c1ccc(Cl)cc1Cl
InChI Key InChIKey=ALNOTCQOWIWEQA-UHFFFAOYSA-N
Data  1 KI
  Tab Delimited (TSV)   2D SDfile   Computed 3D by Vconf -m prep SDfile
Find this compound or compounds like it in BindingDB:
Activity Spreadsheet -- Enzyme Inhibition Constant Data from BindingDB
Found 1 hit for monomerid = 50198525
TargetCannabinoid receptor 1(Homo sapiens (Human))
Bayer Healthcare
Curated by ChEMBL
LigandPNGBDBM50198525(5-cyclohexyl-1-(2,4-dichlorophenyl)-2-(4-fluorophe...)
Affinity DataKi:  6nM. Assay description: Displacement of [3H]CP-55940 from human CB1 receptor expressed in HEK cells
In DepthDetails ArticlePubMed