BDBM50198556 (R)-2-(2-(1H-indol-2-yl)acetamido)-5-guanidino-N-(4-(trifluoromethyl)benzyl)pentanamide::CHEMBL384734
SMILES NC(=N)NCCC[C@@H](NC(=O)Cc1cc2ccccc2[nH]1)C(=O)NCc1ccc(cc1)C(F)(F)F
InChI Key InChIKey=NLLMFKLNLNOLBL-HXUWFJFHSA-N
Data  1 IC50
  Tab Delimited (TSV)   2D SDfile   Computed 3D by Vconf -m prep SDfile
Find this compound or compounds like it in BindingDB:
Activity Spreadsheet -- Enzyme Inhibition Constant Data from BindingDB
Found 1 hit for monomerid = 50198556
TargetMelanin-concentrating hormone receptor 1(Homo sapiens (Human))
Procter & Gamble Pharmaceuticals
Curated by ChEMBL
LigandPNGBDBM50198556((R)-2-(2-(1H-indol-2-yl)acetamido)-5-guanidino-N-(...)
Affinity DataIC50:  512nM. Assay description: Functional antagonism of MCH-R1 expressed in HEK293 cells
In DepthDetails ArticlePubMed