BDBM50198648 CHEMBL3935430
SMILES COc1ccc(cc1)-n1nc(c2CCN(C(=O)c12)c1ccc(cc1)N1CCCCC1=O)-n1cccc1CN1CCOCC1
InChI Key InChIKey=RQYFTGBDWFVPET-UHFFFAOYSA-N
Data  1 IC50
  Tab Delimited (TSV)   2D SDfile   Computed 3D by Vconf -m prep SDfile
Find this compound or compounds like it in BindingDB:
Activity Spreadsheet -- Enzyme Inhibition Constant Data from BindingDB
Found 1 hit for monomerid = 50198648
TargetCoagulation factor X(Homo sapiens (Human))
Key Laboratory Of Structure-Based Drug Design And Discovery (Shenyang Pharmaceutical University)
Curated by ChEMBL
LigandPNGBDBM50198648(CHEMBL3935430)
Affinity DataIC50:  2.40E+3nM. Assay description: Inhibition of human coagulation factor 10a assessed as reduction in p-nitroaniline cleavage from pefachrome substrate preincubated for 10 mins follow...
In DepthDetails ArticlePubMed