BDBM50198709 (8R,9S,10R,13S,14S,17S)-17-ethynyl-17-hydroxy-10,13-dimethyl-7,8,11,12,13,15,16,17-octahydro-6H-cyclopenta[a]phenanthren-3(9H,10H,14H)-one::CHEMBL241695
SMILES C[C@]12CC[C@H]3[C@@H](CCC4=CC(=O)C=C[C@]34C)[C@@H]1CC[C@@]2(O)C#C
InChI Key InChIKey=DPFJWSXDCNAYDI-CEGNMAFCSA-N
Data  1 IC50
  Tab Delimited (TSV)   2D SDfile   Computed 3D by Vconf -m prep SDfile
Find this compound or compounds like it in BindingDB:
Activity Spreadsheet -- Enzyme Inhibition Constant Data from BindingDB
Found 1 hit for monomerid = 50198709
TargetPolyphenol oxidase 2(Agaricus bisporus (Common mushroom))
Central University Of Las Villas
Curated by ChEMBL
LigandPNGBDBM50198709((8R,9S,10R,13S,14S,17S)-17-ethynyl-17-hydroxy-10,1...)
Affinity DataIC50:  7.89E+3nM. Assay description: Inhibition of mushroom tyrosinase after 10 mins
In DepthDetails ArticlePubMed