BDBM50198894 CHEMBL3959175
SMILES Fc1ccc(COc2ccc(\C=C3\SC(=S)NC3=O)cc2Cl)cc1
InChI Key InChIKey=ZVERSDWSMSUDNZ-OVCLIPMQSA-N
Data  1 KI  1 IC50
  Tab Delimited (TSV)   2D SDfile   Computed 3D by Vconf -m prep SDfile
Find this compound or compounds like it in BindingDB:
Activity Spreadsheet -- Enzyme Inhibition Constant Data from BindingDB
Found 2 hits for monomerid = 50198894
TargetCDGSH iron-sulfur domain-containing protein 1(Homo sapiens (Human))
West Virginia University
Curated by ChEMBL
LigandPNGBDBM50198894(CHEMBL3959175)
Affinity DataKi:  40nM. Assay description: Displacement of [3H]rosiglitazone from recombinant human C-terminal His-tagged MitoNEET cytosolic domain (32 to 108 residues) expressed in Escherichi...
In DepthDetails ArticlePubMed
TargetCDGSH iron-sulfur domain-containing protein 1(Homo sapiens (Human))
West Virginia University
Curated by ChEMBL
LigandPNGBDBM50198894(CHEMBL3959175)
Affinity DataIC50:  945nM. Assay description: Displacement of [3H]rosiglitazone from recombinant human C-terminal His-tagged MitoNEET cytosolic domain (32 to 108 residues) expressed in Escherichi...
In DepthDetails ArticlePubMed