BDBM50199017 CHEMBL224514::N-[2-(2-chlorophenyl)-5-hydroxy-4-oxo-4H-chromen-8-yl]methanesulfonamide
SMILES CS(=O)(=O)Nc1ccc(O)c2c1oc(cc2=O)-c1ccccc1Cl
InChI Key InChIKey=ISNOHYNRCDDGAH-UHFFFAOYSA-N
Data  1 IC50
  Tab Delimited (TSV)   2D SDfile   Computed 3D by Vconf -m prep SDfile
Find this compound or compounds like it in BindingDB:
Activity Spreadsheet -- Enzyme Inhibition Constant Data from BindingDB
Found 1 hit for monomerid = 50199017
TargetCyclin-A1/Cyclin-A2/Cyclin-dependent kinase 2(Homo sapiens (Human))
University Of Kansas
Curated by ChEMBL
LigandPNGBDBM50199017(CHEMBL224514 | N-[2-(2-chlorophenyl)-5-hydroxy-4-o...)
Affinity DataIC50:  2.19E+5nM. Assay description: Inhibition of CDK2/Cyclin A
In DepthDetails ArticlePubMed