BDBM50199193 3-phenacyl-1-beta-D-ribofuranosylpyrimidine-2,4-dione 2'-Monophosphate-5'-triphosphate::CHEMBL265170
SMILES O[C@@H]1[C@@H](COP(O)(=O)OP(O)(=O)OP(O)(O)=O)O[C@H]([C@@H]1OP(O)(O)=O)n1ccc(=O)n(CC(=O)c2ccccc2)c1=O
InChI Key InChIKey=QTOAFQFXYVDFKV-DTZQCDIJSA-N
Data  2 EC50
  Tab Delimited (TSV)   2D SDfile   Computed 3D by Vconf -m prep SDfile
Find this compound or compounds like it in BindingDB:
Activity Spreadsheet -- Enzyme Inhibition Constant Data from BindingDB
Found 2 hits for monomerid = 50199193
TargetP2Y purinoceptor 4(Homo sapiens (Human))
University Of Bonn
Curated by ChEMBL
LigandPNGBDBM50199193(3-phenacyl-1-beta-D-ribofuranosylpyrimidine-2,4-di...)
Affinity DataEC50: >1.00E+5nM. Assay description: Agonist activity at human P2Y4 receptor expressed in 1321N1 cells assessed as IP accumulation by SPA
In DepthDetails ArticlePubMed
TargetP2Y purinoceptor 6(Homo sapiens (Human))
University Of Bonn
Curated by ChEMBL
LigandPNGBDBM50199193(3-phenacyl-1-beta-D-ribofuranosylpyrimidine-2,4-di...)
Affinity DataEC50: >1.00E+3nM. Assay description: Agonist activity at human P2Y6 receptor expressed in 1321N1 cells assessed as IP accumulation by SPA
In DepthDetails ArticlePubMed