BDBM50199264 6-(4-chlorophenyl)-3-[2-(morpholin-4-ylmethyl)-1-benzothien-5-yl]thieno[3,2-d]pyrimidin-4(3H)-one::CHEMBL386900
SMILES Clc1ccc(cc1)-c1cc2ncn(-c3ccc4sc(CN5CCOCC5)cc4c3)c(=O)c2s1
InChI Key InChIKey=QUPILHSZFLDDLG-UHFFFAOYSA-N
Data  1 IC50
  Tab Delimited (TSV)   2D SDfile   Computed 3D by Vconf -m prep SDfile
Find this compound or compounds like it in BindingDB:
Activity Spreadsheet -- Enzyme Inhibition Constant Data from BindingDB
Found 1 hit for monomerid = 50199264
TargetMelanin-concentrating hormone receptor 1(Homo sapiens (Human))
Glaxosmithkline
Curated by ChEMBL
LigandPNGBDBM50199264(6-(4-chlorophenyl)-3-[2-(morpholin-4-ylmethyl)-1-b...)
Affinity DataIC50:  38nM. Assay description: Antagonist activity against human MCH1 receptor stably-expressed in CHO cells by Gal4/Elk1-Luc reporter assay
In DepthDetails ArticlePubMed