BDBM50199316 CHEMBL386269::N-ethyloxycarbonyl-3-(4-imidazol-1-ylmethylphenyl)-5-iso-butylthiophene-2-sulfonamide
SMILES CCOC(=O)NS(=O)(=O)c1sc(CC(C)C)cc1-c1ccc(Cn2ccnc2)cc1
InChI Key InChIKey=LPYXRTXXLKVWKJ-UHFFFAOYSA-N
Data  2 KI
  Tab Delimited (TSV)   2D SDfile   Computed 3D by Vconf -m prep SDfile
Find this compound or compounds like it in BindingDB:
Activity Spreadsheet -- Enzyme Inhibition Constant Data from BindingDB
Found 2 hits for monomerid = 50199316
TargetType-2 angiotensin II receptor(Homo sapiens (Human))
Uppsala University
Curated by ChEMBL
LigandPNGBDBM50199316(CHEMBL386269 | N-ethyloxycarbonyl-3-(4-imidazol-1-...)
Affinity DataKi:  10nM. Assay description: Displacement of [125I]Ang2 from AT2 receptor in pig uterus membrane
In DepthDetails ArticlePubMed
TargetType-2 angiotensin II receptor(RAT)
Uppsala University
Curated by ChEMBL
LigandPNGBDBM50199316(CHEMBL386269 | N-ethyloxycarbonyl-3-(4-imidazol-1-...)
Affinity DataKi: >1.00E+4nM. Assay description: Displacement of [125I]Ang2 from AT2 receptor in rat liver membrane
In DepthDetails ArticlePubMed