BDBM50199394 (9R,12R,15S)-9-(4-hydroxy-benzyl)-12-isopropyl-15-propyl-6,7,8,9,14,15,17,18,19,20-decahydro-5,11-dioxa-8,14,17-triaza-benzocyclooctadecene-10,13,16-trione::CHEMBL386626
SMILES CCC[C@@H]1NC(=O)[C@H](OC(=O)[C@@H](Cc2ccc(O)cc2)NCCOc2ccccc2CCCNC1=O)C(C)C
InChI Key InChIKey=IPARHFSWWMFDAF-ZWEKWIFMSA-N
Data  1 KI
  Tab Delimited (TSV)   2D SDfile   Computed 3D by Vconf -m prep SDfile
Find this compound or compounds like it in BindingDB:
Activity Spreadsheet -- Enzyme Inhibition Constant Data from BindingDB
Found 1 hit for monomerid = 50199394
TargetMotilin receptor(Homo sapiens (Human))
Tranzyme Pharma
Curated by ChEMBL
LigandPNGBDBM50199394((9R,12R,15S)-9-(4-hydroxy-benzyl)-12-isopropyl-15-...)
Affinity DataKi:  192nM. Assay description: Displacement of [125I]motilin from human MOTR
In DepthDetails ArticlePubMed