BDBM50199413 CHEMBL3934066
SMILES C[C@@H](CO)N1C[C@@H](C)[C@H](CN(C)C(=O)NC2CCCCC2)Oc2cc(ccc2S1(=O)=O)C#Cc1cccc(F)c1
InChI Key InChIKey=YAJYINBQFXCAPI-WENCSYSZSA-N
Data  1 IC50
  Tab Delimited (TSV)   2D SDfile   Computed 3D by Vconf -m prep SDfile
Find this compound or compounds like it in BindingDB:
Activity Spreadsheet -- Enzyme Inhibition Constant Data from BindingDB
Found 1 hit for monomerid = 50199413
TargetIsocitrate dehydrogenase [NADP] cytoplasmic(Homo sapiens (Human))
Harvard University
Curated by ChEMBL
LigandPNGBDBM50199413(CHEMBL3934066)
Affinity DataIC50: >2.00E+4nM. Assay description: Inhibition of wild type human C-terminal His8-tagged IDH1 expressed in Escherichia coli Rosetta cells assessed as reduction in isocitrate to alpha-KG...
In DepthDetails ArticlePubMed