BDBM50199428 CHEMBL3890362
SMILES COc1nn2cc(nc2s1)-c1cccc(Cl)c1
InChI Key InChIKey=WBASPFVSESBYHT-UHFFFAOYSA-N
Data  4 IC50
  Tab Delimited (TSV)   2D SDfile   Computed 3D by Vconf -m prep SDfile
Find this compound or compounds like it in BindingDB:
Activity Spreadsheet -- Enzyme Inhibition Constant Data from BindingDB
Found 4 hits for monomerid = 50199428
TargetProteinase-activated receptor 4(Homo sapiens (Human))
Vanderbilt University Medical Center
Curated by ChEMBL
LigandPNGBDBM50199428(CHEMBL3890362)
Affinity DataIC50: >1.00E+4nM. Assay description: Antagonist activity at PAR4 in human platelets assessed as inhibition of gamma-thrombin-induced PAC1 binding response preincubated for 20 mins follow...
In DepthDetails ArticlePubMed
TargetProteinase-activated receptor 4(Homo sapiens (Human))
Vanderbilt University Medical Center
Curated by ChEMBL
LigandPNGBDBM50199428(CHEMBL3890362)
Affinity DataIC50: >1.00E+4nM. Assay description: Antagonist activity at PAR4 in human platelets assessed as inhibition of gamma-thrombin-induced PAC1 binding response preincubated for 20 mins follow...
In DepthDetails ArticlePubMed
TargetProteinase-activated receptor 4(Homo sapiens (Human))
Vanderbilt University Medical Center
Curated by ChEMBL
LigandPNGBDBM50199428(CHEMBL3890362)
Affinity DataIC50:  72nM. Assay description: Antagonist activity at PAR4 in human platelets assessed as inhibition of activating peptide-induced PAC1 binding response preincubated for 20 mins fo...
In DepthDetails ArticlePubMed
TargetProteinase-activated receptor 4(Homo sapiens (Human))
Vanderbilt University Medical Center
Curated by ChEMBL
LigandPNGBDBM50199428(CHEMBL3890362)
Affinity DataIC50:  73nM. Assay description: Antagonist activity at PAR4 in human platelets assessed as inhibition of activating peptide-induced PAC1 binding response preincubated for 20 mins fo...
In DepthDetails ArticlePubMed