BDBM50199500 1-(5-((2H-tetrazol-5-yl)carbamoyl)-2,3-dihydro-1H-inden-1-yl)-3-(3,5-bis(trifluoromethyl)phenyl)-1-((1r,4r)-4-tert-butylcyclohexyl)urea::CHEMBL407028
SMILES CC(C)(C)[C@H]1CC[C@@H](CC1)N(C1CCc2cc(ccc12)C(=O)Nc1nnn[nH]1)C(=O)Nc1cc(cc(c1)C(F)(F)F)C(F)(F)F
InChI Key InChIKey=CQCNJVFXKAWPPK-ZCAYIEKSSA-N
Data  3 IC50
  Tab Delimited (TSV)   2D SDfile   Computed 3D by Vconf -m prep SDfile
Find this compound or compounds like it in BindingDB:
Activity Spreadsheet -- Enzyme Inhibition Constant Data from BindingDB
Found 3 hits for monomerid = 50199500
TargetGastric inhibitory polypeptide receptor(Homo sapiens (Human))
Merck Research Laboratories
Curated by ChEMBL
LigandPNGBDBM50199500(1-(5-((2H-tetrazol-5-yl)carbamoyl)-2,3-dihydro-1H-...)
Affinity DataIC50:  4.26E+3nM. Assay description: Antagonist activity at human GIP receptor transfected in CHO cells assessed as inhibition of glucagon-induced cAMP accumulation
In DepthDetails ArticlePubMed
TargetGlucagon receptor(Homo sapiens (Human))
Merck Research Laboratories
Curated by ChEMBL
LigandPNGBDBM50199500(1-(5-((2H-tetrazol-5-yl)carbamoyl)-2,3-dihydro-1H-...)
Affinity DataIC50:  7.60nM. Assay description: Displacement of [125]glucagon from human glucagon receptor expressed in CHO cells
In DepthDetails ArticlePubMed
TargetGlucagon receptor(Homo sapiens (Human))
Merck Research Laboratories
Curated by ChEMBL
LigandPNGBDBM50199500(1-(5-((2H-tetrazol-5-yl)carbamoyl)-2,3-dihydro-1H-...)
Affinity DataIC50:  61nM. Assay description: Antagonist activity at human glucagon receptor transfected in CHO cells assessed as inhibition of glucagon-induced cAMP accumulation
In DepthDetails ArticlePubMed